{"text_format":"1","workbook":"xlsx","n_sheets":2,"sheets":["Carta de Presentación","Datos Ocultos"],"not_rendered":{"charts":0,"images":0,"macros":1,"external_links":0,"defined_names":0,"comments":0,"pivot_tables":0},"unopened":[],"bounds":{"document_bytes":16777216,"sheet_cells":100000,"rows_first":2000,"rows_last":500,"rows_between":2000,"halvings":0,"cell_chars":16384,"cell_head_chars":4096},"cells_cut":0,"cells_raw":0,"read":"whole","date_system":"1900"}

{"sheet":"Carta de Presentación","index":0,"n_rows":38,"n_cols":8,"rows_kept":38,"cut":false,"hidden":false,"merged":[[31,1,31,8],[20,6,20,8],[23,6,23,8],[26,6,26,8],[21,6,21,8],[22,6,22,8],[19,6,19,8],[28,6,28,8],[29,6,29,8],[7,2,8,8],[10,1,11,8],[13,3,13,6],[14,3,14,6],[16,3,16,6],[15,3,15,6],[18,6,18,8],[24,7,25,8]]}
[]
[null,"Carta de Presentación de Oferta"]
[]
[null,null,null,null,null,null,"Buenos Aires 27 de Abril de 2023"]
[]
[null,"Sres.  Compañía Administradora del Mercado Eléctrico Mayorista S.A. "]
[]
[null,"Ref.:","Convocatoria Abierta Nacional e Internacional en el Marco de la Resolución SE N°36/2023 (RenMDI)"]
[]
[]
[null,"Declaro que la información que manifiesto en esta oferta tiene carácter de declaración jurada. Asimismo, tomo conocimiento que cualquier falsedad y/o error en la información que en este acto manifiesto, producirá que mi Oferta no sea evaluada y por ende sea desestimada."]
[]
[]
[null,"NOMBRE DEL PROYECTO"]
[null,"OFERENTE"]
[null,"RENGLÓN",null,null,null,null,null,"(*)"]
[null,"TECNOLOGIA",null,"BM - BioMasa"]
[]
[null,"Potencia Ofertada [MW]"]
[null,"Almacenamiento Potencia [MW] (si aplica)"]
[null,"Almacenamiento Horas de Entrega (si aplica)"]
[null,"Provincia"]
[null,"Localidad"]
[null,"Distribuidora / PAFTT"]
[null,"Nodo de Conexión (NDC) (Para Renglón 1 / Anexo 3) - ID",null,null,null,null,null,{"$f":"IF(OR(G25=\"\",D16<>1),\"\",VLOOKUP(G25,'Datos Ocultos'!$T$6:$U$299,2,FALSE))","v":""}]
[null,"Nodo de Conexión (NDC) (Para Renglón 1 / Anexo 3) - Tensión [kV]"]
[null,"Punto de Conexión - Descripción"]
[null,"Punto de Conexión - Nivel de Tensión [kV]"]
[null,"Coordenadas geográficas del Proyecto - Latitud (**)"]
[null,"Coordenadas geográficas del Proyecto - Longitud (**)"]
[null,"(**) Coordenadas geográficas en grados decimales (WGS84)"]
[null,"El Oferente se compromete a mantener la presente Oferta por el plazo de 240 días corridos en los términos establecidos en el Artículo 10 del PBC."]
[]
[]
[]
[null,"(firma y aclaración del representante legal o apoderado de cada persona que integra el Oferente)"]
[]
[null,"(*) Para la Tecnología BioMasa, las ofertas no adjudicadas en Renglón 1 pasan a participar del Renglón 2"]

{"sheet":"Datos Ocultos","index":1,"n_rows":299,"n_cols":324,"rows_kept":299,"cut":false,"hidden":true,"merged":[]}
[null,{"$f":"'Carta de Presentación'!D16","v":0}]
[null,"TECNOLOGIA",null,null,null,"TECNOLOGIA R1",null,null,null,null,null,"PROVINCIAS","Validación:",1]
[]
[{"$f":"IF($B$1=1,1,IF($B$1=2,5,9))","v":9},{"$f":"VLOOKUP(A4,$G$4:$H$12,2,FALSE)","v":""},null,null,null,"TECNOLOGIA R1",1,"BM - BioMasa",null,null,null,"BUENOS AIRES",null,null,null,null,null,null,null,"NODO","DESC","Kv1","Kv2","Kv3","Kv4",null,null,null,null,null,null,null,null,null,null,null,null,null,null,null,null,null,null,null,null,null,null,null,null,null,null,null,null,null,null,null,null,null,null,null,null,null,null,null,null,null,null,null,null,null,null,null,null,null,null,null,null,null,null,null,null,null,null,null,null,null,null,null,null,null,null,null,null,null,null,null,null,null,null,null,null,null,null,null,null,null,null,null,null,null,null,null,null,null,null,null,null,null,null,null,null,null,null,null,null,null,null,null,null,null,null,null,null,null,null,null,null,null,null,null,null,null,null,null,null,null,null,null,null,null,null,null,null,null,null,null,null,null,null,null,null,null,null,null,null,null,null,null,null,null,null,null,null,null,null,null,null,null,null,null,null,null,null,null,null,null,null,null,null,null,null,null,null,null,null,null,null,null,null,null,null,null,null,null,null,null,null,null,null,null,null,null,null,null,null,null,null,null,null,null,null,null,null,null,null,null,null,null,null,null,null,null,null,null,null,null,null,null,null,null,null,null,null,null,null,null,null,null,null,null,null,null,null,null,null,null,null,null,null,null,null,null,null,null,null,null,null,null,null,null,null,null,null,null,null,null,null,null,null,null,null,null,null,null,null,null,null,null,null,null,null,null,null,null,null,null,null,null,null,null,null,null,null,null,null,null,null,null,null,null,null,null,null,null,null,null,null,null,null,null,null,null,null,"c"]
[{"$f":"IF($B$1=1,2,IF($B$1=2,6,9))","v":9},{"$f":"VLOOKUP(A5,$G$4:$H$12,2,FALSE)","v":""},null,null,null,"TECNOLOGIA R1",2,"EOLA - Eólica con Almacenamiento",null,null,null,"CABA","ID","NOMBRE / E.T.","Tensiones"]
[{"$f":"IF($B$1=1,3,IF($B$1=2,7,9))","v":9},"",null,null,null,"TECNOLOGIA R1",3,"SFV - Solar Fotovoltaico",null,null,null,"CATAMARCA",562,"VILLA DOLORES",13.2,33,"-",132,{"$f":"IF(OR('Carta de Presentación'!$D$16=2,'Carta de Presentación'!$D$16=\"\"),\"\",T6)","v":""},14,"AGUILARES",13.2,33,"-",132,null,null,null,null,null,562,269,299,437,5326,5141,190,1294,258,4601,308,572,91,565,5313,5453,475,5264,5294,5321,29,5104,244,52,284,1097,243,5357,582,214,5290,270,446,5272,274,277,212,5301,5143,1098,631,4989,141,427,2333,5273,1135,5205,507,5206,268,487,303,4980,5204,5043,3973,3953,566,4947,364,452,148,5492,50000,50001,50002,546,22,87,4253,5493,304,4921,4920,498,385,210,5257,309,5037,5007,5374,101,476,409,1438,5198,450,5404,353,366,1436,1437,173,4653,238,463,5062,53,5471,1053,5534,5468,1394,1393,1434,5454,363,5188,323,150,5458,5429,209,5505,184,4964,4573,5078,46,5081,5054,415,489,5457,456,5077,4986,97,5391,560,5079,5055,112,4952,4843,1453,404,1433,5114,4957,125,201,1513,5139,64,481,500,1493,221,174,501,2273,146,4994,4995,82,5362,1613,280,5443,5331,4913,94,196,553,461,213,673,4841,484,578,30,653,2933,183,317,428,1633,473,480,526,1573,5363,568,434,5199,5142,3233,466,355,126,540,3253,348,90,325,19,61,524,563,4851,402,585,316,4033,474,161,339,330,4886,321,117,312,301,627,296,388,50388,26,145,470,109,4693,253,294,237,454,4842,405,43,401,648,636,635,159,320,432,1873,4904,205,5103,506,3398,21,527,193,3399,5073,4898,3353,255,202,448,14,204,1903,5337,225,3513,2833,357,4971,532,5094,5223,4827,248,395,5347,287,497,483,279,252,5336,111,347,15,266,4815,378,1233,5342,99,4996,4933,435,488,3613,536,1195,51]
[{"$f":"IF($B$1=1,4,IF($B$1=2,8,9))","v":9},"",null,null,null,"TECNOLOGIA R1",4,"SFVA - Solar Fotovoltaico con Almacenamiento",null,null,null,"CHACO",269,"LA VIÑA",13.2,"-",66,132,{"$f":"IF(OR('Carta de Presentación'!$D$16=2,'Carta de Presentación'!$D$16=\"\"),\"\",T7)","v":""},15,"AIMOGASTA",13.2,33,"-","-",null,null,null,null,null,13.2,13.2,13.2,"-",13.2,13.2,13.2,13.2,13.2,13.2,13.2,13.2,13.2,13.2,13.2,13.2,13.2,13.2,13.2,13.2,"-","-",13.2,13.2,"-",13.2,"-","-","-",13.2,13.2,13.2,13.2,"-",13.2,13.2,"-",13.2,13.2,13.2,"-","-",13.2,13.2,13.2,13.2,13.2,13.2,13.2,13.2,13.2,13.2,13.2,13.2,13.2,13.2,13.2,13.2,13.2,13.2,13.2,13.2,13.2,13.2,13.2,13.2,13.2,13.2,13.2,13.2,13.2,13.2,13.2,13.2,13.2,13.2,13.2,13.2,"-",13.2,13.2,13.2,"-",13.2,"-",13.2,13.2,13.2,13.2,13.2,13.2,13.2,13.2,13.2,13.2,13.2,13.2,13.2,13.2,13.2,13.2,13.2,13.2,13.2,13.2,13.2,13.2,13.2,13.2,13.2,13.2,13.2,13.2,13.2,13.2,13.2,13.2,"-",13.2,13.2,13.2,13.2,13.2,13.2,13.2,13.2,13.2,13.2,13.2,13.2,13.2,13.2,13.2,13.2,13.2,13.2,13.2,13.2,13.2,13.2,13.2,13.2,13.2,13.2,13.2,13.2,13.2,13.2,13.2,13.2,13.2,13.2,13.2,13.2,13.2,"-","-",13.2,"-",13.2,13.2,13.2,"-",13.2,13.2,13.2,13.2,13.2,13.2,13.2,13.2,13.2,13.2,13.2,13.2,13.2,13.2,13.2,13.2,13.2,13.2,13.2,13.2,13.2,"-",13.2,13.2,13.2,13.2,13.2,13.2,13.2,13.2,13.2,"-",13.2,13.2,13.2,13.2,13.2,13.2,13.2,13.2,13.2,13.2,13.2,13.2,13.2,13.2,13.2,13.2,"-",13.2,13.2,13.2,13.2,"-","-",13.2,"-",13.2,13.2,"-",13.2,13.2,13.2,13.2,13.2,13.2,13.2,13.2,13.2,13.2,13.2,"-",13.2,13.2,"-",13.2,"-",13.2,13.2,13.2,13.2,13.2,13.2,13.2,13.2,13.2,13.2,13.2,13.2,13.2,13.2,13.2,13.2,13.2,13.2,"-",13.2,13.2,"-",13.2,"-",13.2,13.2,"-",13.2,13.2,13.2,"-",13.2,13.2,13.2,13.2,13.2,"-",13.2,"-",13.2,13.2,13.2,13.2,13.2,13.2,13.2,13.2,13.2,13.2,13.2,"-",13.2,13.2,13.2]
[null,null,null,null,null,"TECNOLOGIA R2",5,"BG - BioGas",null,null,null,"CHUBUT",299,"MOLINOS",13.2,33,"-",132,{"$f":"IF(OR('Carta de Presentación'!$D$16=2,'Carta de Presentación'!$D$16=\"\"),\"\",T8)","v":""},19,"ALMIRANTE BROWN",13.2,"-","-",132,null,null,null,null,null,33,"-",33,33,"-","-","-","-","-","-","-","-","-","-","-","-","-","-","-","-","-",33,33,"-","-","-",33,"-","-","-","-","-","-",33,"-","-",33,"-","-","-",33,"-","-","-","-","-","-",33,33,33,33,33,33,33,33,33,33,33,33,33,"-","-","-","-","-","-","-","-","-","-","-","-","-","-","-",33,"-","-",33,33,33,33,33,33,"-",33,33,33,33,33,33,33,33,33,33,33,33,33,33,33,33,33,33,33,33,33,33,33,33,33,33,33,33,33,33,33,33,33,33,33,33,33,33,33,33,33,33,33,33,33,33,33,33,33,33,33,33,33,33,33,33,33,33,33,33,33,33,33,33,33,33,33,33,33,33,33,33,33,"-",33,33,33,"-",33,33,33,33,33,33,33,33,33,33,33,33,33,33,33,33,33,33,33,33,33,"-",33,33,33,33,33,33,33,33,33,"-",33,33,"-","-",33,"-","-","-","-",33,"-",33,33,33,"-",33,"-",33,33,33,33,"-",33,33,"-",33,33,"-",33,33,33,33,33,33,33,33,33,33,33,33,33,33,33,33,33,33,33,33,33,33,33,33,33,33,33,33,33,33,33,33,33,33,33,33,33,33,"-",33,"-",33,33,33,33,33,33,"-",33,33,33,33,33,33,33,"-",33,33,33,33,33,33,33,33,33,33,33,33,33,33,33]
[null,null,null,null,null,"TECNOLOGIA R2",6,"BM - BioMasa",null,null,null,"CORDOBA",437,"REOLIN","-",33,66,132,{"$f":"IF(OR('Carta de Presentación'!$D$16=2,'Carta de Presentación'!$D$16=\"\"),\"\",T9)","v":""},21,"AÑATUYA",13.2,33,"-",132,null,null,null,null,null,"-",66,"-",66,66,"-","-","-",66,66,"-","-",66,66,66,"-",66,66,"-",66,"-","-",66,"-",66,66,66,"-","-",66,66,66,"-","-",66,"-","-",66,66,66,"-","-","-","-","-",66,66,"-","-","-","-","-","-","-","-","-","-","-","-","-","-","-",66,66,66,66,66,66,66,66,66,66,66,66,66,66,66,66,"-","-","-","-","-","-","-","-","-","-","-","-","-","-","-","-","-","-","-","-","-","-","-","-","-","-","-","-","-","-","-","-","-","-","-","-","-","-","-","-","-","-","-","-","-","-","-","-","-","-","-","-","-","-","-","-","-","-","-","-","-","-","-","-","-","-","-","-","-","-","-","-","-","-","-","-","-","-","-","-","-","-","-","-","-","-","-","-","-","-","-","-","-","-","-","-","-","-","-","-","-","-","-","-","-","-","-","-","-","-","-","-","-","-","-","-","-","-",66,"-","-","-","-","-","-","-","-","-","-","-","-","-","-","-","-","-","-",66,66,66,"-",66,66,66,"-","-","-","-","-","-","-","-","-","-","-","-","-","-","-","-","-","-","-","-","-","-","-","-","-","-","-","-","-","-","-","-","-","-","-","-","-","-","-",66,"-","-","-","-","-","-","-","-","-","-","-","-","-","-","-","-",66,"-","-","-","-","-","-","-","-","-","-","-","-","-","-","-"]
[null,null,null,null,null,"TECNOLOGIA R2",7,"BRS - BioGas de Relleno Sanitario",null,null,null,"CORRIENTES",5326,"RIO GRANDE",13.2,"-",66,"-",{"$f":"IF(OR('Carta de Presentación'!$D$16=2,'Carta de Presentación'!$D$16=\"\"),\"\",T10)","v":""},22,"ANCHORIS",13.2,"-",66,132,null,null,null,null,null,132,132,132,132,"-",132,132,132,132,"-",132,132,132,132,132,132,132,132,132,"-",132,132,132,132,132,"-","-",132,132,132,"-","-",132,132,132,132,132,132,"-","-",132,132,132,132,132,"-","-",132,132,132,132,132,132,132,132,132,132,132,132,132,132,132,132,"-","-","-","-","-",132,132,"-","-","-","-","-",132,132,132,132,132,132,132,132,132,132,132,132,132,132,132,132,132,132,132,132,132,132,132,132,132,132,132,132,132,132,132,132,132,132,132,132,132,132,132,132,132,132,"-",132,132,132,132,132,132,132,132,132,132,132,132,132,132,132,132,132,132,132,132,132,132,132,132,132,132,132,132,132,132,132,132,132,132,132,"-",132,"-","-",132,132,132,132,132,132,132,132,132,132,132,132,132,132,132,132,132,132,132,132,132,132,132,132,132,132,132,132,132,132,132,132,132,132,132,132,132,132,132,"-",132,132,132,132,"-","-","-","-","-","-","-",132,132,132,132,132,132,132,132,"-","-",132,132,"-","-",132,132,132,132,132,132,132,132,132,132,132,132,132,132,132,132,132,132,132,132,132,132,132,132,132,132,132,132,132,132,132,132,132,132,132,132,"-",132,132,132,132,132,132,132,132,132,132,132,132,132,132,132,132,132,"-",132,132,"-",132,132,132,132,132,132,132,132,132,132,"-",132,132,132]
[null,null,null,null,null,"TECNOLOGIA R2",8,"PAH - Pequeño Aprovechamiento Hidráulico",null,null,null,"ENTRE RIOS",5141,"S. A. ARREDONDO",13.2,"-","-",132,{"$f":"IF(OR('Carta de Presentación'!$D$16=2,'Carta de Presentación'!$D$16=\"\"),\"\",T11)","v":""},26,"ARRECIFES",13.2,33,66,"-",null,null,null,null,null,{"$f":"'Carta de Presentación'!G25","v":0}]
[null,"RENGLÓN",null,null,null,null,9,{"$f":"\"\"","v":""},null,null,null,"FORMOSA",190,"F. CAÑETE",13.2,"-","-",132,{"$f":"IF(OR('Carta de Presentación'!$D$16=2,'Carta de Presentación'!$D$16=\"\"),\"\",T12)","v":""},29,"ARROYO CABRAL","-","-","-",132]
[null,null,null,null,null,null,null,null,null,null,null,"JUJUY",1294,"BIALET MASSE",13.2,"-","-",132,{"$f":"IF(OR('Carta de Presentación'!$D$16=2,'Carta de Presentación'!$D$16=\"\"),\"\",T13)","v":""},30,"ARRUFO",13.2,33,"-",132,null,null,null,null,{"$f":"IF(OR('Carta de Presentación'!$D$16<>1,'Carta de Presentación'!$G$25=\"\"),\"\",AG13)","v":""},{"$f":"HLOOKUP($AE$11,$AE$6:$LL$10,2,FALSE)","v":{"$error":"#N/A"}},{"$f":"MIN(AE13:AE16)","v":{"$error":"#N/A"}},{"$f":"AF13","v":{"$error":"#N/A"}}]
[null,1,null,null,null,null,null,null,null,null,null,"LA PAMPA",258,"LA FALDA",13.2,"-",66,132,{"$f":"IF(OR('Carta de Presentación'!$D$16=2,'Carta de Presentación'!$D$16=\"\"),\"\",T14)","v":""},43,"BARILOCHE",13.2,33,"-",132,null,null,null,null,{"$f":"IF(OR('Carta de Presentación'!$D$16<>1,'Carta de Presentación'!$G$25=\"\"),\"\",AG14)","v":""},{"$f":"HLOOKUP($AE$11,$AE$6:$LL$10,3,FALSE)","v":{"$error":"#N/A"}},{"$f":"MIN(IF(AE13:AE16>AF13,AE13:AE16,\"\"))","v":{"$error":"#N/A"}},{"$f":"IF(AF14=0,\"\",AF14)","v":{"$error":"#N/A"}}]
[null,2,null,null,null,null,null,null,null,null,null,"LA RIOJA",4601,"CRUZ DEL EJE",13.2,"-",66,"-",{"$f":"IF(OR('Carta de Presentación'!$D$16=2,'Carta de Presentación'!$D$16=\"\"),\"\",T15)","v":""},46,"BARRANQUERAS",13.2,33,"-",132,null,null,null,null,{"$f":"IF(OR('Carta de Presentación'!$D$16<>1,'Carta de Presentación'!$G$25=\"\"),\"\",AG15)","v":""},{"$f":"HLOOKUP($AE$11,$AE$6:$LL$10,4,FALSE)","v":{"$error":"#N/A"}},{"$f":"IF(AF14=0,0,MIN(IF(AE13:AE16>AF14,AE13:AE16,\"\")))","v":{"$error":"#N/A"}},{"$f":"IF(AF15=0,\"\",AF15)","v":{"$error":"#N/A"}}]
[null,null,null,null,null,null,null,null,null,null,null,"MENDOZA",308,"MALAGUEÑO",13.2,"-","-",132,{"$f":"IF(OR('Carta de Presentación'!$D$16=2,'Carta de Presentación'!$D$16=\"\"),\"\",T16)","v":""},51,"BELEN",13.2,33,"-",132,null,null,null,null,{"$f":"IF(OR('Carta de Presentación'!$D$16<>1,'Carta de Presentación'!$G$25=\"\"),\"\",AG16)","v":""},{"$f":"HLOOKUP($AE$11,$AE$6:$LL$10,5,FALSE)","v":{"$error":"#N/A"}},{"$f":"IF(AF15=0,0,MIN(IF(AE13:AE16>AF15,AE13:AE16,\"\")))","v":{"$error":"#N/A"}},{"$error":"#N/A"}]
[null,null,null,null,null,null,null,null,null,null,null,"MISIONES",572,"YOCSINA",13.2,"-","-",132,{"$f":"IF(OR('Carta de Presentación'!$D$16=2,'Carta de Presentación'!$D$16=\"\"),\"\",T17)","v":""},52,"BELL VILLE",13.2,"-","-",132]
[null,null,null,null,null,null,null,null,null,null,null,"NEUQUEN",91,"CARLOS PAZ",13.2,"-",66,132,{"$f":"IF(OR('Carta de Presentación'!$D$16=2,'Carta de Presentación'!$D$16=\"\"),\"\",T18)","v":""},53,"BELLA VISTA",13.2,33,"-",132]
[null,null,null,null,null,null,null,null,null,null,null,"RIO NEGRO",565,"VILLA MARIA",13.2,"-",66,132,{"$f":"IF(OR('Carta de Presentación'!$D$16=2,'Carta de Presentación'!$D$16=\"\"),\"\",T19)","v":""},61,"BURZACO",13.2,33,"-",132]
[null,null,null,null,null,null,null,null,null,null,null,"SALTA",5313,"VILLA MARIA NORTE",13.2,"-",66,132,{"$f":"IF(OR('Carta de Presentación'!$D$16=2,'Carta de Presentación'!$D$16=\"\"),\"\",T20)","v":""},64,"C. DEL URUGUAY",13.2,33,"-",132]
[null,null,null,null,null,null,null,null,null,null,null,"SAN JUAN",5453,"LAS VARILLAS",13.2,"-","-",132,{"$f":"IF(OR('Carta de Presentación'!$D$16=2,'Carta de Presentación'!$D$16=\"\"),\"\",T21)","v":""},82,"CANADA DE GOMEZ",13.2,33,"-",132]
[null,null,null,null,null,null,null,null,null,null,null,"SAN LUIS",475,"SAN FRANCISCO",13.2,"-",66,132,{"$f":"IF(OR('Carta de Presentación'!$D$16=2,'Carta de Presentación'!$D$16=\"\"),\"\",T22)","v":""},87,"CAPIZ",13.2,"-",66,132]
[null,null,null,null,null,null,null,null,null,null,null,"SANTA CRUZ",5264,"AFISA",13.2,"-",66,132,{"$f":"IF(OR('Carta de Presentación'!$D$16=2,'Carta de Presentación'!$D$16=\"\"),\"\",T23)","v":""},90,"CARLOS CASARES",13.2,33,66,"-"]
[null,null,null,null,null,null,null,null,null,null,null,"SANTA FE",5294,"MORTEROS",13.2,"-","-",132,{"$f":"IF(OR('Carta de Presentación'!$D$16=2,'Carta de Presentación'!$D$16=\"\"),\"\",T24)","v":""},91,"CARLOS PAZ",13.2,"-",66,132]
[null,null,null,null,null,null,null,null,null,null,null,"SGO.DEL ESTERO",5321,"TIO PUJIO",13.2,"-",66,"-",{"$f":"IF(OR('Carta de Presentación'!$D$16=2,'Carta de Presentación'!$D$16=\"\"),\"\",T25)","v":""},94,"CASILDA",13.2,33,"-",132]
[null,null,null,null,null,null,null,null,null,null,null,"TUCUMAN",29,"ARROYO CABRAL","-","-","-",132,{"$f":"IF(OR('Carta de Presentación'!$D$16=2,'Carta de Presentación'!$D$16=\"\"),\"\",T26)","v":""},97,"CASTELLI CHACO",13.2,33,"-",132]
[null,null,null,null,null,null,null,null,null,null,null,null,5104,"J. POSSE","-",33,"-",132,{"$f":"IF(OR('Carta de Presentación'!$D$16=2,'Carta de Presentación'!$D$16=\"\"),\"\",T27)","v":""},99,"CATAMARCA",13.2,33,"-",132]
[null,null,null,null,null,null,null,null,null,null,null,null,244,"ISLA VERDE",13.2,33,66,132,{"$f":"IF(OR('Carta de Presentación'!$D$16=2,'Carta de Presentación'!$D$16=\"\"),\"\",T28)","v":""},101,"CAUCETE",13.2,33,"-",132]
[null,null,null,null,null,null,null,null,null,null,null,null,52,"BELL VILLE",13.2,"-","-",132,{"$f":"IF(OR('Carta de Presentación'!$D$16=2,'Carta de Presentación'!$D$16=\"\"),\"\",T29)","v":""},109,"CHACABUCO",13.2,33,"-",132]
[null,null,null,null,null,null,null,null,null,null,null,null,284,"LEONES","-","-",66,132,{"$f":"IF(OR('Carta de Presentación'!$D$16=2,'Carta de Presentación'!$D$16=\"\"),\"\",T30)","v":""},111,"CHAMICAL",13.2,33,"-",132]
[null,null,null,null,null,null,null,null,null,null,null,null,1097,"SAN MARCOS SUD",13.2,"-",66,"-",{"$f":"IF(OR('Carta de Presentación'!$D$16=2,'Carta de Presentación'!$D$16=\"\"),\"\",T31)","v":""},112,"CHARATA",13.2,33,"-",132]
[null,null,null,null,null,null,null,null,null,null,null,null,243,"INRIVILLE","-",33,66,"-",{"$f":"IF(OR('Carta de Presentación'!$D$16=2,'Carta de Presentación'!$D$16=\"\"),\"\",T32)","v":""},117,"CHIVILCOY",13.2,33,"-",132]
[null,null,null,null,null,null,null,null,null,null,null,null,5357,"ACHIRAS","-","-","-",132,{"$f":"IF(OR('Carta de Presentación'!$D$16=2,'Carta de Presentación'!$D$16=\"\"),\"\",T33)","v":""},125,"CLORINDA",13.2,33,"-",132]
[null,null,null,null,null,null,null,null,null,null,null,null,582,"MARANZANA II","-","-","-",132,{"$f":"IF(OR('Carta de Presentación'!$D$16=2,'Carta de Presentación'!$D$16=\"\"),\"\",T34)","v":""},126,"CNEL. DORREGO",13.2,33,"-",132]
[null,null,null,null,null,null,null,null,null,null,null,null,214,"GRAL. LEVALLE",13.2,"-",66,132,{"$f":"IF(OR('Carta de Presentación'!$D$16=2,'Carta de Presentación'!$D$16=\"\"),\"\",T35)","v":""},141,"CORDOBA SUROESTE",13.2,"-","-",132]
[null,null,null,null,null,null,null,null,null,null,null,null,5290,"ADELIA MARIA",13.2,"-",66,"-",{"$f":"IF(OR('Carta de Presentación'!$D$16=2,'Carta de Presentación'!$D$16=\"\"),\"\",T36)","v":""},145,"CPTAN SARMIENTO",13.2,33,66,"-"]
[null,null,null,null,null,null,null,null,null,null,null,null,270,"LABOULAYE",13.2,"-",66,"-",{"$f":"IF(OR('Carta de Presentación'!$D$16=2,'Carta de Presentación'!$D$16=\"\"),\"\",T37)","v":""},146,"CRESPO-E.RIOS",13.2,33,"-",132]
[null,null,null,null,null,null,null,null,null,null,null,null,446,"RIO CUARTO",13.2,"-","-",132,{"$f":"IF(OR('Carta de Presentación'!$D$16=2,'Carta de Presentación'!$D$16=\"\"),\"\",T38)","v":""},148,"CRUZ DE PIEDRA",13.2,"-",66,132]
[null,null,null,null,null,null,null,null,null,null,null,null,5272,"SANTA ELENA CBA","-",33,"-",132,{"$f":"IF(OR('Carta de Presentación'!$D$16=2,'Carta de Presentación'!$D$16=\"\"),\"\",T39)","v":""},150,"CURUZU CUATIA",13.2,33,"-",132]
[null,null,null,null,null,null,null,null,null,null,null,null,274,"LAS FERIAS",13.2,"-",66,132,{"$f":"IF(OR('Carta de Presentación'!$D$16=2,'Carta de Presentación'!$D$16=\"\"),\"\",T40)","v":""},159,"DIVISADEROS",13.2,33,"-",132]
[null,null,null,null,null,null,null,null,null,null,null,null,277,"LAS HIGUERAS",13.2,"-","-",132,{"$f":"IF(OR('Carta de Presentación'!$D$16=2,'Carta de Presentación'!$D$16=\"\"),\"\",T41)","v":""},161,"DOLORES",13.2,33,"-",132]
[null,null,null,null,null,null,null,null,null,null,null,null,212,"GRAL. DEHEZA","-",33,"-",132,{"$f":"IF(OR('Carta de Presentación'!$D$16=2,'Carta de Presentación'!$D$16=\"\"),\"\",T42)","v":""},173,"EL DORADO",13.2,33,"-",132]
[null,null,null,null,null,null,null,null,null,null,null,null,5301,"PROMAIZ",13.2,"-",66,132,{"$f":"IF(OR('Carta de Presentación'!$D$16=2,'Carta de Presentación'!$D$16=\"\"),\"\",T43)","v":""},174,"EL PINGO",13.2,33,"-",132]
[null,null,null,null,null,null,null,null,null,null,null,null,5143,"ALEJANDRO ROCA",13.2,"-",66,"-",{"$f":"IF(OR('Carta de Presentación'!$D$16=2,'Carta de Presentación'!$D$16=\"\"),\"\",T44)","v":""},183,"ESPERANZA",13.2,33,"-",132]
[null,null,null,null,null,null,null,null,null,null,null,null,1098,"LA CARLOTA",13.2,"-",66,"-",{"$f":"IF(OR('Carta de Presentación'!$D$16=2,'Carta de Presentación'!$D$16=\"\"),\"\",T45)","v":""},184,"ESQUINA",13.2,33,"-",132]
[null,null,null,null,null,null,null,null,null,null,null,null,631,"TANCACHA","-",33,"-",132,{"$f":"IF(OR('Carta de Presentación'!$D$16=2,'Carta de Presentación'!$D$16=\"\"),\"\",T46)","v":""},190,"F. CAÑETE",13.2,"-","-",132]
[null,null,null,null,null,null,null,null,null,null,null,null,4989,"13 DE JULIO","-","-","-",132,{"$f":"IF(OR('Carta de Presentación'!$D$16=2,'Carta de Presentación'!$D$16=\"\"),\"\",T47)","v":""},193,"FERNANDEZ",13.2,33,"-",132]
[null,null,null,null,null,null,null,null,null,null,null,null,141,"CORDOBA SUROESTE",13.2,"-","-",132,{"$f":"IF(OR('Carta de Presentación'!$D$16=2,'Carta de Presentación'!$D$16=\"\"),\"\",T48)","v":""},196,"FIRMAT",13.2,33,"-",132]
[null,null,null,null,null,null,null,null,null,null,null,null,427,"R. DEL BUSTO",13.2,"-","-",132,{"$f":"IF(OR('Carta de Presentación'!$D$16=2,'Carta de Presentación'!$D$16=\"\"),\"\",T49)","v":""},201,"FORMOSA I",13.2,33,"-",132]
[null,null,null,null,null,null,null,null,null,null,null,null,2333,"GUINAZU",13.2,"-","-",132,{"$f":"IF(OR('Carta de Presentación'!$D$16=2,'Carta de Presentación'!$D$16=\"\"),\"\",T50)","v":""},202,"FRIAS (*)",13.2,33,"-",132]
[null,null,null,null,null,null,null,null,null,null,null,null,5273,"V.DE MARIA SECO",13.2,"-",66,"-",{"$f":"IF(OR('Carta de Presentación'!$D$16=2,'Carta de Presentación'!$D$16=\"\"),\"\",T51)","v":""},204,"INDEPENDENCIA (*)",13.2,33,"-",132]
[null,null,null,null,null,null,null,null,null,null,null,null,1135,"VILLA ROSARIO",13.2,"-",66,"-",{"$f":"IF(OR('Carta de Presentación'!$D$16=2,'Carta de Presentación'!$D$16=\"\"),\"\",T52)","v":""},205,"GENERAL PICO",13.2,33,"-",132]
[null,null,null,null,null,null,null,null,null,null,null,null,5205,"MERLO SAN LUIS",13.2,33,"-",132,{"$f":"IF(OR('Carta de Presentación'!$D$16=2,'Carta de Presentación'!$D$16=\"\"),\"\",T53)","v":""},209,"GOYA",13.2,33,"-",132]
[null,null,null,null,null,null,null,null,null,null,null,null,507,"SANTA ROSA S.LUIS",13.2,33,"-",132,{"$f":"IF(OR('Carta de Presentación'!$D$16=2,'Carta de Presentación'!$D$16=\"\"),\"\",T54)","v":""},210,"GENERAL ALVEAR",13.2,"-",66,132]
[null,null,null,null,null,null,null,null,null,null,null,null,5206,"TILISARAO S. LUIS",13.2,33,"-",132,{"$f":"IF(OR('Carta de Presentación'!$D$16=2,'Carta de Presentación'!$D$16=\"\"),\"\",T55)","v":""},212,"GRAL. DEHEZA","-",33,"-",132]
[null,null,null,null,null,null,null,null,null,null,null,null,268,"LA TOMA",13.2,33,"-",132,{"$f":"IF(OR('Carta de Presentación'!$D$16=2,'Carta de Presentación'!$D$16=\"\"),\"\",T56)","v":""},213,"GRAL. LAGOS",13.2,33,"-",132]
[null,null,null,null,null,null,null,null,null,null,null,null,487,"SAN LUIS",13.2,33,"-",132,{"$f":"IF(OR('Carta de Presentación'!$D$16=2,'Carta de Presentación'!$D$16=\"\"),\"\",T57)","v":""},214,"GRAL. LEVALLE",13.2,"-",66,132]
[null,null,null,null,null,null,null,null,null,null,null,null,303,"LUJAN",13.2,33,"-",132,{"$f":"IF(OR('Carta de Presentación'!$D$16=2,'Carta de Presentación'!$D$16=\"\"),\"\",T58)","v":""},221,"GUALEGUAY",13.2,33,"-",132]
[null,null,null,null,null,null,null,null,null,null,null,null,4980,"LA CUMBRE",13.2,33,"-",132,{"$f":"IF(OR('Carta de Presentación'!$D$16=2,'Carta de Presentación'!$D$16=\"\"),\"\",T59)","v":""},225,"GUEMES",13.2,33,"-",132]
[null,null,null,null,null,null,null,null,null,null,null,null,5204,"SAN LUIS CENTRO",13.2,33,"-",132,{"$f":"IF(OR('Carta de Presentación'!$D$16=2,'Carta de Presentación'!$D$16=\"\"),\"\",T60)","v":""},237,"I.M.S.A.",13.2,33,"-",132]
{"$rows_left_out":239}