{"text_format":"1","workbook":"xlsx","n_sheets":5,"sheets":["DATOS_QR","ETIQUETA_EXT","ETIQUETA_A","ETIQUETA_B","DATOS"],"not_rendered":{"charts":0,"images":0,"macros":1,"external_links":0,"defined_names":3,"comments":0,"pivot_tables":0},"unopened":[],"bounds":{"document_bytes":16777216,"sheet_cells":100000,"rows_first":2000,"rows_last":500,"rows_between":2000,"halvings":0,"cell_chars":16384,"cell_head_chars":4096},"cells_cut":0,"cells_raw":0,"read":"whole","date_system":"1900"}

{"sheet":"DATOS_QR","index":0,"n_rows":59,"n_cols":16,"rows_kept":59,"cut":false,"hidden":false,"merged":[[16,7,17,8],[18,6,18,8],[58,4,58,5],[47,3,47,8],[48,3,48,8],[46,3,46,8],[35,3,35,8],[42,3,42,8],[45,3,45,8],[54,4,54,5],[56,4,56,5],[39,3,39,8],[40,3,40,8],[41,3,41,8],[36,3,36,8],[19,6,19,8],[11,6,11,8],[12,6,12,8],[13,6,13,8],[14,6,14,8],[15,6,15,8],[5,5,5,8],[6,5,6,8],[8,5,8,8],[7,5,7,8],[10,6,10,8],[29,3,29,8],[30,3,30,8],[33,3,33,8],[34,3,34,8],[20,6,20,8],[21,6,21,8],[22,6,22,8],[27,3,27,8],[28,3,28,8]]}
[]
[null,"DATOS PARA GENERAR QR",null,null,null,null,null,null,null,null,null,null,{"$f":"SUM(M6:M11)+SUM(M14:M18)+SUM(M20:M37)","v":20},null,{"$f":"P3&O3","v":"|||||||||||||||||||||||||||||||||717618929136*******************************************************************************************************************************************************************************************************************************************************************************************************************************************************************************************************************************************************************************************************************************************************************************************************************************************************************************************************************************************************************************************************************************************************************************************************************************************************************************************"}]
[null,null,null,null,null,null,null,null,null,null,null,null,{"$f":"SUM(M5:M49)","v":32},null,{"$f":"IF(LEN(P3)>999,\"\",REPT(\"*\",1000-LEN(P3)))","v":"*******************************************************************************************************************************************************************************************************************************************************************************************************************************************************************************************************************************************************************************************************************************************************************************************************************************************************************************************************************************************************************************************************************************************************************************************************************************************************************************************"},{"$f":"CONCATENATE(O4,\"|\",O5,\"|\",O6,\"|\",O7,\"|\",O8,\"|\",O9,\"|\",O10,\"|\",O11,\"|\",O12,\"|\",O13,\"|\",O14,\"|\",O15,\"|\",O16,\"|\",O17,\"|\",O18,\"|\",O19,\"|\",O20,\"|\",O21,\"|\",O22,\"|\",O23,\"|\",O24,\"|\",O25,\"|\",O26,\"|\",O27,\"|\",O28,\"|\",O29,\"|\",O30,\"|\",O31,\"|\",O32,\"|\",O33,\"|\",O34,\"|\",O35,\"|\",O36,\"|\",ROUND(RANDBETWEEN(0,10^12-1),0))","v":"|||||||||||||||||||||||||||||||||717618929136"}]
[null,"Datos de la Oferta",null,null,null,null,null,null,null,null,null,null,null,null,{"$f":"IF(F6=\"\",\"\",F6)","v":""}]
[null,null,null,null,null,null,null,null,null,null,null,null,{"$f":"IF(AND(F8=\"\",SUM(M17:M18)=0),2,\"\")","v":2},null,{"$f":"IF(F7=\"\",\"\",F7)","v":""}]
[null,"NOMBRE DEL PROYECTO *",null,null,null,null,null,null,null,null,null,null,{"$f":"IF(F6=\"\",1,0)","v":1},null,{"$f":"IF(F8=\"\",\"\",F8)","v":""}]
[null,"OFERENTE *",null,null,null,null,null,null,null,null,null,null,{"$f":"IF(F7=\"\",1,0)","v":1},null,{"$f":"IF(F9=\"\",\"\",LEFT(F9,FIND(\" \",F9)-1))","v":""}]
[null,"RENGLÓN *",null,null,null,null,null,null,null,null,null,null,{"$f":"IF(F8=\"\",1,0)","v":1},null,{"$f":"IF(G11=\"\",\"\",SUBSTITUTE(G11,\".\",\",\"))","v":""}]
[null,"TECNOLOGÍA *",null,null,null,null,null,null,null,null,null,null,{"$f":"IF(F9=\"\",1,0)","v":1},null,{"$f":"IF(G12=\"\",\"\",SUBSTITUTE(G12,\".\",\",\"))","v":""}]
[null,null,null,null,null,null,null,null,null,null,null,null,null,null,""]
[null,"Potencia Ofertada [MW] *",null,null,null,null,null,null,null,null,null,null,{"$f":"IF(G11=\"\",1,0)","v":1},null,{"$f":"IF(G14=\"\",\"\",G14)","v":""}]
[null,"Almacenamiento Potencia [MW] (si aplica) ",null,null,null,null,null,null,null,null,null,null,{"$f":"IF(G12=\"\",1,0)","v":1},null,""]
[null,"Almacenamiento Horas de Entrega (si aplica) ",null,null,null,null,null,null,null,null,null,null,1,null,""]
[null,"Provincia *",null,null,null,null,null,null,null,null,null,null,1,null,""]
[null,"Localidad *",null,null,null,null,null,null,null,null,null,null,1,null,""]
[null,"Distribuidora Agente MEM *",null,null,null,null,null,null,null,null,null,null,1,null,""]
[null,"Nodo de Conexión (NDC) (Para Renglón 1 / Anexo 3) - ID *",null,null,null,null,null,{"$f":"IF(OR(G17=\"\",F8<>1),\"\",VLOOKUP(G17,DATOS!$T$6:$U$299,2,FALSE))","v":""},null,null,null,null,{"$f":"IF(AND(G17=\"\",F8=1),1,0)","v":0},null,""]
[null,"Nodo de Conexión (NDC) (Para Renglón 1 / Anexo 3) - Tensión [kV] *",null,null,null,null,null,null,null,null,null,null,{"$f":"IF(AND(G18=\"\",F8=1),1,0)","v":0},null,{"$f":"IF(G21=\"\",\"\",SUBSTITUTE(G21,\".\",\",\"))","v":""}]
[null,"Cooperativa No Agente (si corresponde) ",null,null,null,null,null,null,null,null,null,null,null,null,""]
[null,"Punto de Conexión - Descripción *",null,null,null,null,null,null,null,null,null,null,1,null,""]
[null,"Punto de Conexión - Nivel de Tensión [kV] *",null,null,null,null,null,null,null,null,null,null,1,null,{"$f":"IF(D28=\"\",\"\",D28)","v":""}]
[null,"Coordenadas geográficas del Proyecto - Latitud (**) *",null,null,null,null,null,null,null,null,null,null,{"$f":"IF(G22=\"\",1,0)","v":1},null,{"$f":"IF(D29=\"\",\"\",D29)","v":""}]
[null,"Coordenadas geográficas del Proyecto - Longitud (**) *",null,null,null,null,null,null,null,null,null,null,{"$f":"IF(G23=\"\",1,0)","v":1},null,{"$f":"IF(D30=\"\",\"\",D30)","v":""}]
[null,"(**) Coordenadas geográficas en grados decimales (WGS84)",null,null,null,null,null,null,null,null,null,null,null,null,{"$f":"IF(D31=\"\",\"\",D31)","v":""}]
[null,null,null,null,null,null,null,null,null,null,null,null,null,null,{"$f":"IF(D34=\"\",\"\",D34)","v":""}]
[null,"Información del Oferente",null,null,null,null,null,null,null,null,null,null,null,null,{"$f":"IF(D35=\"\",\"\",D35)","v":""}]
[null,null,null,null,null,null,null,null,null,null,null,null,null,null,{"$f":"IF(D36=\"\",\"\",D36)","v":""}]
[null,"Nombre o Razón Social *",null,null,null,null,null,null,null,null,null,null,{"$f":"IF(D28=\"\",1,0)","v":1},null,{"$f":"IF(D37=\"\",\"\",D37)","v":""}]
[null,"CUIT *",null,null,null,null,null,null,null,null,null,null,{"$f":"IF(D29=\"\",1,0)","v":1},null,{"$f":"IF(D40=\"\",\"\",D40)","v":""}]
[null,"Domicilio Legal *",null,null,null,null,null,null,null,null,null,null,1,null,{"$f":"IF(D41=\"\",\"\",D41)","v":""}]
{"$rows_left_out":30}
{"sheet":"ETIQUETA_EXT","index":1,"n_rows":22,"n_cols":8,"rows_kept":22,"cut":false,"hidden":false,"merged":[[4,4,4,7],[5,4,5,7],[6,4,6,7],[7,4,7,7],[21,4,21,5],[19,5,19,6]]}
[]
[]
[null,null,"ETIQUETA SOBRE EXTERNO"]
[null,null,"Convocatoria Abierta Nacional e Internacional RenMDI - Res. SE N°36/2023"]
[null,null,"NOMBRE DEL PROYECTO",null,{"$f":"IF(DATOS_QR!F6=\"\",\"\",DATOS_QR!F6)","v":""}]
[null,null,"OFERENTE",null,{"$f":"IF(DATOS_QR!F7=\"\",\"\",DATOS_QR!F7)","v":""}]
[null,null,"TECNOLOGÍA",null,{"$f":"IF(DATOS_QR!F9=\"\",\"\",DATOS_QR!F9)","v":""}]
[null,null,"RENGLÓN",null,{"$f":"IF(DATOS_QR!F8=\"\",\"\",DATOS_QR!F8)","v":""}]
[null,null,"POTENCIA [MW]",null,{"$f":"IF(DATOS_QR!G11=\"\",\"\",DATOS_QR!G11)","v":""}]
[]
[]
[]
[]
[]
[]
[]
[]
[]
[]
[null,null,"ID OFERTA:",null,{"$f":"IF(OR(E7=\"\",E8=\"\"),\"\",CONCATENATE(LEFT(E7,FIND(\" - \",E7)-1),\"-\"))","v":""},null,null,{"$f":"IF(OR(E7=\"\",E8=\"\"),\"\",CONCATENATE(\"-R\",E8))","v":""}]
[]
[null,null,null,null,"VOLVER"]

{"sheet":"ETIQUETA_A","index":2,"n_rows":22,"n_cols":8,"rows_kept":22,"cut":false,"hidden":false,"merged":[[4,4,4,7],[5,4,5,7],[6,4,6,7],[7,4,7,7],[21,4,21,5],[19,5,19,6]]}
[]
[]
[null,null,"ETIQUETA SOBRE A"]
[null,null,"Convocatoria Abierta Nacional e Internacional RenMDI - Res. SE N°36/2023"]
[null,null,"NOMBRE DEL PROYECTO",null,{"$f":"IF(DATOS_QR!F6=\"\",\"\",DATOS_QR!F6)","v":""}]
[null,null,"OFERENTE",null,{"$f":"IF(DATOS_QR!F7=\"\",\"\",DATOS_QR!F7)","v":""}]
[null,null,"TECNOLOGÍA",null,{"$f":"IF(DATOS_QR!F9=\"\",\"\",DATOS_QR!F9)","v":""}]
[null,null,"RENGLÓN",null,{"$f":"IF(DATOS_QR!F8=\"\",\"\",DATOS_QR!F8)","v":""}]
[null,null,"POTENCIA [MW]",null,{"$f":"IF(DATOS_QR!G11=\"\",\"\",DATOS_QR!G11)","v":""}]
[]
[]
[]
[]
[]
[]
[]
[]
[]
[]
[null,null,"ID OFERTA:",null,{"$f":"IF(OR(E7=\"\",E8=\"\"),\"\",CONCATENATE(LEFT(E7,FIND(\" - \",E7)-1),\"-\"))","v":""},null,null,{"$f":"IF(OR(E7=\"\",E8=\"\"),\"\",CONCATENATE(\"-R\",E8))","v":""}]
[]
[null,null,null,null,"VOLVER"]

{"sheet":"ETIQUETA_B","index":3,"n_rows":22,"n_cols":8,"rows_kept":22,"cut":false,"hidden":false,"merged":[[4,4,4,7],[5,4,5,7],[6,4,6,7],[7,4,7,7],[21,4,21,5],[19,5,19,6]]}
[]
[]
[null,null,"ETIQUETA SOBRE B"]
[null,null,"Convocatoria Abierta Nacional e Internacional RenMDI - Res. SE N°36/2023"]
[null,null,"NOMBRE DEL PROYECTO",null,{"$f":"IF(DATOS_QR!F6=\"\",\"\",DATOS_QR!F6)","v":""}]
[null,null,"OFERENTE",null,{"$f":"IF(DATOS_QR!F7=\"\",\"\",DATOS_QR!F7)","v":""}]
[null,null,"TECNOLOGÍA",null,{"$f":"IF(DATOS_QR!F9=\"\",\"\",DATOS_QR!F9)","v":""}]
[null,null,"RENGLÓN",null,{"$f":"IF(DATOS_QR!F8=\"\",\"\",DATOS_QR!F8)","v":""}]
[null,null,"POTENCIA [MW]",null,{"$f":"IF(DATOS_QR!G11=\"\",\"\",DATOS_QR!G11)","v":""}]
[]
[]
[]
[]
[]
[]
[]
[]
[]
[]
[null,null,"ID OFERTA:",null,{"$f":"IF(OR(E7=\"\",E8=\"\"),\"\",CONCATENATE(LEFT(E7,FIND(\" - \",E7)-1),\"-\"))","v":""},null,null,{"$f":"IF(OR(E7=\"\",E8=\"\"),\"\",CONCATENATE(\"-R\",E8))","v":""}]
[]
[null,null,null,null,"VOLVER"]

{"sheet":"DATOS","index":4,"n_rows":299,"n_cols":324,"rows_kept":299,"cut":false,"hidden":true,"merged":[]}
[]
[null,null,null,null,null,null,null,null,null,null,null,null,"Validación:",0]
[]
[null,"PROVINCIAS",null,null,null,null,"AGENTE_DESCRIPCION","AGENTE_ID","DEMANDA_NEMO_AGENTE",null,null,null,null,null,null,null,null,null,null,"NODO","DESC","Kv1","Kv2","Kv3","Kv4",null,null,null,null,null,null,null,null,null,null,null,null,null,null,null,null,null,null,null,null,null,null,null,null,null,null,null,null,null,null,null,null,null,null,null,null,null,null,null,null,null,null,null,null,null,null,null,null,null,null,null,null,null,null,null,null,null,null,null,null,null,null,null,null,null,null,null,null,null,null,null,null,null,null,null,null,null,null,null,null,null,null,null,null,null,null,null,null,null,null,null,null,null,null,null,null,null,null,null,null,null,null,null,null,null,null,null,null,null,null,null,null,null,null,null,null,null,null,null,null,null,null,null,null,null,null,null,null,null,null,null,null,null,null,null,null,null,null,null,null,null,null,null,null,null,null,null,null,null,null,null,null,null,null,null,null,null,null,null,null,null,null,null,null,null,null,null,null,null,null,null,null,null,null,null,null,null,null,null,null,null,null,null,null,null,null,null,null,null,null,null,null,null,null,null,null,null,null,null,null,null,null,null,null,null,null,null,null,null,null,null,null,null,null,null,null,null,null,null,null,null,null,null,null,null,null,null,null,null,null,null,null,null,null,null,null,null,null,null,null,null,null,null,null,null,null,null,null,null,null,null,null,null,null,null,null,null,null,null,null,null,null,null,null,null,null,null,null,null,null,null,null,null,null,null,null,null,null,null,null,null,null,null,null,null,null,null,null,null,null,null,null,null,null,null,null,null,null,"c"]
[null,null,null,null,null,null,null,null,null,null,"ID","Corredor","ID","NOMBRE / E.T.","Tensiones"]
[null,"BUENOS AIRES",null,null,null,null,"EDENOR DISTRIBUIDOR",1,"EDENOROD",null,562,"CEN - Cordoba - Oeste",562,"VILLA DOLORES",13.2,33,"-",132,{"$f":"IF(OR(DATOS_QR!$F$8=2,DATOS_QR!$F$8=\"\"),\"\",T6)","v":""},14,"AGUILARES",13.2,33,"-",132,null,null,null,null,null,562,269,299,437,5326,5141,190,1294,258,4601,308,572,91,565,5313,5453,475,5264,5294,5321,29,5104,244,52,284,1097,243,5357,582,214,5290,270,446,5272,274,277,212,5301,5143,1098,631,4989,141,427,2333,5273,1135,5205,507,5206,268,487,303,4980,5204,5043,3973,3953,566,4947,364,452,148,5492,50000,50001,50002,546,22,87,4253,5493,304,4921,4920,498,385,210,5257,309,5037,5007,5374,101,476,409,1438,5198,450,5404,353,366,1436,1437,173,4653,238,463,5062,53,5471,1053,5534,5468,1394,1393,1434,5454,363,5188,323,150,5458,5429,209,5505,184,4964,4573,5078,46,5081,5054,415,489,5457,456,5077,4986,97,5391,560,5079,5055,112,4952,4843,1453,404,1433,5114,4957,125,201,1513,5139,64,481,500,1493,221,174,501,2273,146,4994,4995,82,5362,1613,280,5443,5331,4913,94,196,553,461,213,673,4841,484,578,30,653,2933,183,317,428,1633,473,480,526,1573,5363,568,434,5199,5142,3233,466,355,126,540,3253,348,90,325,19,61,524,563,4851,402,585,316,4033,474,161,339,330,4886,321,117,312,301,627,296,388,50388,26,145,470,109,4693,253,294,237,454,4842,405,43,401,648,636,635,159,320,432,1873,4904,205,5103,506,3398,21,527,193,3399,5073,4898,3353,255,202,448,14,204,1903,5337,225,3513,2833,357,4971,532,5094,5223,4827,248,395,5347,287,497,483,279,252,5336,111,347,15,266,4815,378,1233,5342,99,4996,4933,435,488,3613,536,1195,51]
[null,"CABA",null,null,null,null,"EDESUR DISTRIBUIDOR",2,"EDESURCD",null,269,"CEN - Cordoba - Oeste",269,"LA VIÑA",13.2,"-",66,132,{"$f":"IF(OR(DATOS_QR!$F$8=2,DATOS_QR!$F$8=\"\"),\"\",T7)","v":""},15,"AIMOGASTA",13.2,33,"-","-",null,null,null,null,null,13.2,13.2,13.2,"-",13.2,13.2,13.2,13.2,13.2,13.2,13.2,13.2,13.2,13.2,13.2,13.2,13.2,13.2,13.2,13.2,"-","-",13.2,13.2,"-",13.2,"-","-","-",13.2,13.2,13.2,13.2,"-",13.2,13.2,"-",13.2,13.2,13.2,"-","-",13.2,13.2,13.2,13.2,13.2,13.2,13.2,13.2,13.2,13.2,13.2,13.2,13.2,13.2,13.2,13.2,13.2,13.2,13.2,13.2,13.2,13.2,13.2,13.2,13.2,13.2,13.2,13.2,13.2,13.2,13.2,13.2,13.2,13.2,13.2,13.2,"-",13.2,13.2,13.2,"-",13.2,"-",13.2,13.2,13.2,13.2,13.2,13.2,13.2,13.2,13.2,13.2,13.2,13.2,13.2,13.2,13.2,13.2,13.2,13.2,13.2,13.2,13.2,13.2,13.2,13.2,13.2,13.2,13.2,13.2,13.2,13.2,13.2,13.2,"-",13.2,13.2,13.2,13.2,13.2,13.2,13.2,13.2,13.2,13.2,13.2,13.2,13.2,13.2,13.2,13.2,13.2,13.2,13.2,13.2,13.2,13.2,13.2,13.2,13.2,13.2,13.2,13.2,13.2,13.2,13.2,13.2,13.2,13.2,13.2,13.2,13.2,"-","-",13.2,"-",13.2,13.2,13.2,"-",13.2,13.2,13.2,13.2,13.2,13.2,13.2,13.2,13.2,13.2,13.2,13.2,13.2,13.2,13.2,13.2,13.2,13.2,13.2,13.2,13.2,"-",13.2,13.2,13.2,13.2,13.2,13.2,13.2,13.2,13.2,"-",13.2,13.2,13.2,13.2,13.2,13.2,13.2,13.2,13.2,13.2,13.2,13.2,13.2,13.2,13.2,13.2,"-",13.2,13.2,13.2,13.2,"-","-",13.2,"-",13.2,13.2,"-",13.2,13.2,13.2,13.2,13.2,13.2,13.2,13.2,13.2,13.2,13.2,"-",13.2,13.2,"-",13.2,"-",13.2,13.2,13.2,13.2,13.2,13.2,13.2,13.2,13.2,13.2,13.2,13.2,13.2,13.2,13.2,13.2,13.2,13.2,"-",13.2,13.2,"-",13.2,"-",13.2,13.2,"-",13.2,13.2,13.2,"-",13.2,13.2,13.2,13.2,13.2,"-",13.2,"-",13.2,13.2,13.2,13.2,13.2,13.2,13.2,13.2,13.2,13.2,13.2,"-",13.2,13.2,13.2]
[null,"CATAMARCA",null,null,null,null,"EPEC DISTRIBUIDOR",16,"EPECORXD",null,299,"CEN - Cordoba - Oeste",299,"MOLINOS",13.2,33,"-",132,{"$f":"IF(OR(DATOS_QR!$F$8=2,DATOS_QR!$F$8=\"\"),\"\",T8)","v":""},19,"ALMIRANTE BROWN",13.2,"-","-",132,null,null,null,null,null,33,"-",33,33,"-","-","-","-","-","-","-","-","-","-","-","-","-","-","-","-","-",33,33,"-","-","-",33,"-","-","-","-","-","-",33,"-","-",33,"-","-","-",33,"-","-","-","-","-","-",33,33,33,33,33,33,33,33,33,33,33,33,33,"-","-","-","-","-","-","-","-","-","-","-","-","-","-","-",33,"-","-",33,33,33,33,33,33,"-",33,33,33,33,33,33,33,33,33,33,33,33,33,33,33,33,33,33,33,33,33,33,33,33,33,33,33,33,33,33,33,33,33,33,33,33,33,33,33,33,33,33,33,33,33,33,33,33,33,33,33,33,33,33,33,33,33,33,33,33,33,33,33,33,33,33,33,33,33,33,33,33,33,"-",33,33,33,"-",33,33,33,33,33,33,33,33,33,33,33,33,33,33,33,33,33,33,33,33,33,"-",33,33,33,33,33,33,33,33,33,"-",33,33,"-","-",33,"-","-","-","-",33,"-",33,33,33,"-",33,"-",33,33,33,33,"-",33,33,"-",33,33,"-",33,33,33,33,33,33,33,33,33,33,33,33,33,33,33,33,33,33,33,33,33,33,33,33,33,33,33,33,33,33,33,33,33,33,33,33,33,33,"-",33,"-",33,33,33,33,33,33,"-",33,33,33,33,33,33,33,"-",33,33,33,33,33,33,33,33,33,33,33,33,33,33,33]
[null,"CHACO",null,null,null,null,"APELP",17,"APELPALD",null,437,"CEN - Cordoba - Oeste",437,"REOLIN","-",33,66,132,{"$f":"IF(OR(DATOS_QR!$F$8=2,DATOS_QR!$F$8=\"\"),\"\",T9)","v":""},21,"AÑATUYA",13.2,33,"-",132,null,null,null,null,null,"-",66,"-",66,66,"-","-","-",66,66,"-","-",66,66,66,"-",66,66,"-",66,"-","-",66,"-",66,66,66,"-","-",66,66,66,"-","-",66,"-","-",66,66,66,"-","-","-","-","-",66,66,"-","-","-","-","-","-","-","-","-","-","-","-","-","-","-",66,66,66,66,66,66,66,66,66,66,66,66,66,66,66,66,"-","-","-","-","-","-","-","-","-","-","-","-","-","-","-","-","-","-","-","-","-","-","-","-","-","-","-","-","-","-","-","-","-","-","-","-","-","-","-","-","-","-","-","-","-","-","-","-","-","-","-","-","-","-","-","-","-","-","-","-","-","-","-","-","-","-","-","-","-","-","-","-","-","-","-","-","-","-","-","-","-","-","-","-","-","-","-","-","-","-","-","-","-","-","-","-","-","-","-","-","-","-","-","-","-","-","-","-","-","-","-","-","-","-","-","-","-","-",66,"-","-","-","-","-","-","-","-","-","-","-","-","-","-","-","-","-","-",66,66,66,"-",66,66,66,"-","-","-","-","-","-","-","-","-","-","-","-","-","-","-","-","-","-","-","-","-","-","-","-","-","-","-","-","-","-","-","-","-","-","-","-","-","-","-",66,"-","-","-","-","-","-","-","-","-","-","-","-","-","-","-","-",66,"-","-","-","-","-","-","-","-","-","-","-","-","-","-","-"]
[null,"CHUBUT",null,null,null,null,"DPE CORRIENTES",20,"DPCORRWD",null,5326,"CEN - Cordoba - Oeste",5326,"RIO GRANDE",13.2,"-",66,"-",{"$f":"IF(OR(DATOS_QR!$F$8=2,DATOS_QR!$F$8=\"\"),\"\",T10)","v":""},22,"ANCHORIS",13.2,"-",66,132,null,null,null,null,null,132,132,132,132,"-",132,132,132,132,"-",132,132,132,132,132,132,132,132,132,"-",132,132,132,132,132,"-","-",132,132,132,"-","-",132,132,132,132,132,132,"-","-",132,132,132,132,132,"-","-",132,132,132,132,132,132,132,132,132,132,132,132,132,132,132,132,"-","-","-","-","-",132,132,"-","-","-","-","-",132,132,132,132,132,132,132,132,132,132,132,132,132,132,132,132,132,132,132,132,132,132,132,132,132,132,132,132,132,132,132,132,132,132,132,132,132,132,132,132,132,132,"-",132,132,132,132,132,132,132,132,132,132,132,132,132,132,132,132,132,132,132,132,132,132,132,132,132,132,132,132,132,132,132,132,132,132,132,"-",132,"-","-",132,132,132,132,132,132,132,132,132,132,132,132,132,132,132,132,132,132,132,132,132,132,132,132,132,132,132,132,132,132,132,132,132,132,132,132,132,132,132,"-",132,132,132,132,"-","-","-","-","-","-","-",132,132,132,132,132,132,132,132,"-","-",132,132,"-","-",132,132,132,132,132,132,132,132,132,132,132,132,132,132,132,132,132,132,132,132,132,132,132,132,132,132,132,132,132,132,132,132,132,132,132,132,"-",132,132,132,132,132,132,132,132,132,132,132,132,132,132,132,132,132,"-",132,132,"-",132,132,132,132,132,132,132,132,132,132,"-",132,132,132]
[null,"CORDOBA",null,null,null,null,"EPEN DISTRIBUIDOR",25,"EPENEUQD",null,5141,"CEN - Cordoba - Punilla",5141,"S. A. ARREDONDO",13.2,"-","-",132,{"$f":"IF(OR(DATOS_QR!$F$8=2,DATOS_QR!$F$8=\"\"),\"\",T11)","v":""},26,"ARRECIFES",13.2,33,66,"-",null,null,null,null,null,{"$f":"DATOS_QR!G17","v":0}]
[null,"CORRIENTES",null,null,null,null,"SECHEEP",28,"SECHEPHD",null,190,"CEN - Cordoba - Punilla",190,"F. CAÑETE",13.2,"-","-",132,{"$f":"IF(OR(DATOS_QR!$F$8=2,DATOS_QR!$F$8=\"\"),\"\",T12)","v":""},29,"ARROYO CABRAL","-","-","-",132]
[null,"ENTRE RIOS",null,null,null,null,"EDELAP SA",34,"EDELAPID",null,1294,"CEN - Cordoba - Punilla",1294,"BIALET MASSE",13.2,"-","-",132,{"$f":"IF(OR(DATOS_QR!$F$8=2,DATOS_QR!$F$8=\"\"),\"\",T13)","v":""},30,"ARRUFO",13.2,33,"-",132,null,null,null,null,{"$f":"IF(OR(DATOS_QR!$F$8<>1,DATOS_QR!$G$17=\"\"),\"\",AG13)","v":""},{"$f":"HLOOKUP($AE$11,$AE$6:$LL$10,2,FALSE)","v":{"$error":"#N/A"}},{"$f":"MIN(AE13:AE16)","v":{"$error":"#N/A"}},{"$f":"AF13","v":{"$error":"#N/A"}}]
[null,"FORMOSA",null,null,null,null,"EDE TUCUMAN",35,"EDETUCTD",null,258,"CEN - Cordoba - Punilla",258,"LA FALDA",13.2,"-",66,132,{"$f":"IF(OR(DATOS_QR!$F$8=2,DATOS_QR!$F$8=\"\"),\"\",T14)","v":""},43,"BARILOCHE",13.2,33,"-",132,null,null,null,null,{"$f":"IF(OR(DATOS_QR!$F$8<>1,DATOS_QR!$G$17=\"\"),\"\",AG14)","v":""},{"$f":"HLOOKUP($AE$11,$AE$6:$LL$10,3,FALSE)","v":{"$error":"#N/A"}},{"$f":"MIN(IF(AE13:AE16>AF13,AE13:AE16,\"\"))","v":{"$error":"#N/A"}},{"$f":"IF(AF14=0,\"\",AF14)","v":{"$error":"#N/A"}}]
[null,"JUJUY",null,null,null,null,"EDESAL DISTRIBUIDOR",62,"EDESALDD",null,4601,"CEN - Cordoba - Punilla",4601,"CRUZ DEL EJE",13.2,"-",66,"-",{"$f":"IF(OR(DATOS_QR!$F$8=2,DATOS_QR!$F$8=\"\"),\"\",T15)","v":""},46,"BARRANQUERAS",13.2,33,"-",132,null,null,null,null,{"$f":"IF(OR(DATOS_QR!$F$8<>1,DATOS_QR!$G$17=\"\"),\"\",AG15)","v":""},{"$f":"HLOOKUP($AE$11,$AE$6:$LL$10,4,FALSE)","v":{"$error":"#N/A"}},{"$f":"IF(AF14=0,0,MIN(IF(AE13:AE16>AF14,AE13:AE16,\"\")))","v":{"$error":"#N/A"}},{"$f":"IF(AF15=0,\"\",AF15)","v":{"$error":"#N/A"}}]
[null,"LA PAMPA",null,null,null,null,"EPESF DISTRIBUIDOR",132,"EPESAFSD",null,308,"CEN - Cordoba - Punilla",308,"MALAGUEÑO",13.2,"-","-",132,{"$f":"IF(OR(DATOS_QR!$F$8=2,DATOS_QR!$F$8=\"\"),\"\",T16)","v":""},51,"BELEN",13.2,33,"-",132,null,null,null,null,{"$f":"IF(OR(DATOS_QR!$F$8<>1,DATOS_QR!$G$17=\"\"),\"\",AG16)","v":""},{"$f":"HLOOKUP($AE$11,$AE$6:$LL$10,5,FALSE)","v":{"$error":"#N/A"}},{"$f":"IF(AF15=0,0,MIN(IF(AE13:AE16>AF15,AE13:AE16,\"\")))","v":{"$error":"#N/A"}},{"$error":"#N/A"}]
[null,"LA RIOJA",null,null,null,null,"EMPRESA DIS. S. ESTERO SA",265,"EDESAEGD",null,572,"CEN - Cordoba - Punilla",572,"YOCSINA",13.2,"-","-",132,{"$f":"IF(OR(DATOS_QR!$F$8=2,DATOS_QR!$F$8=\"\"),\"\",T17)","v":""},52,"BELL VILLE",13.2,"-","-",132]
[null,"MENDOZA",null,null,null,null,"RECURSOS Y ENERGIA FORMOSA SA",343,"REFSAFPD",null,91,"CEN - Cordoba - Punilla",91,"CARLOS PAZ",13.2,"-",66,132,{"$f":"IF(OR(DATOS_QR!$F$8=2,DATOS_QR!$F$8=\"\"),\"\",T18)","v":""},53,"BELLA VISTA",13.2,33,"-",132]
[null,"MISIONES",null,null,null,null,"EMP. DE ENERGIA DE LA RIOJA SA",507,"EDELARFD",null,565,"CEN - Cordoba - Norte",565,"VILLA MARIA",13.2,"-",66,132,{"$f":"IF(OR(DATOS_QR!$F$8=2,DATOS_QR!$F$8=\"\"),\"\",T19)","v":""},61,"BURZACO",13.2,33,"-",132]
[null,"NEUQUEN",null,null,null,null,"ENERGIA SAN JUAN SA EX-EDESSA",837,"ESANJUJD",null,5313,"CEN - Cordoba - Norte",5313,"VILLA MARIA NORTE",13.2,"-",66,132,{"$f":"IF(OR(DATOS_QR!$F$8=2,DATOS_QR!$F$8=\"\"),\"\",T20)","v":""},64,"C. DEL URUGUAY",13.2,33,"-",132]
[null,"RIO NEGRO",null,null,null,null,"ENERGIA DE CATAMARCA S.A.",838,"EDECATKD",null,5453,"CEN - Cordoba - Norte",5453,"LAS VARILLAS",13.2,"-","-",132,{"$f":"IF(OR(DATOS_QR!$F$8=2,DATOS_QR!$F$8=\"\"),\"\",T21)","v":""},82,"CANADA DE GOMEZ",13.2,33,"-",132]
[null,"SALTA",null,null,null,null,"ENERGIA DE ENTRE RIOS SA",1053,"ENERSAED",null,475,"CEN - Cordoba - Norte",475,"SAN FRANCISCO",13.2,"-",66,132,{"$f":"IF(OR(DATOS_QR!$F$8=2,DATOS_QR!$F$8=\"\"),\"\",T22)","v":""},87,"CAPIZ",13.2,"-",66,132]
[null,"SAN JUAN",null,null,null,null,"EMP.DIST.ENERGIA DE SALTA",1157,"EDESASAD",null,5264,"CEN - Cordoba - Norte",5264,"AFISA",13.2,"-",66,132,{"$f":"IF(OR(DATOS_QR!$F$8=2,DATOS_QR!$F$8=\"\"),\"\",T23)","v":""},90,"CARLOS CASARES",13.2,33,66,"-"]
[null,"SAN LUIS",null,null,null,null,"EMP DE ENERGIA DE RIO NEGRO SA",1160,"EDERSARD",null,5294,"CEN - Cordoba - Norte",5294,"MORTEROS",13.2,"-","-",132,{"$f":"IF(OR(DATOS_QR!$F$8=2,DATOS_QR!$F$8=\"\"),\"\",T24)","v":""},91,"CARLOS PAZ",13.2,"-",66,132]
[null,"SANTA CRUZ",null,null,null,null,"EMP.ELECTRIC.DE MISIONES S.A.",1163,"EMISSAND",null,5321,"CEN - Cordoba - Norte",5321,"TIO PUJIO",13.2,"-",66,"-",{"$f":"IF(OR(DATOS_QR!$F$8=2,DATOS_QR!$F$8=\"\"),\"\",T25)","v":""},94,"CASILDA",13.2,33,"-",132]
[null,"SANTA FE",null,null,null,null,"DIST. ELECTRICA DE CAUCETE",1184,"DECSASJW",null,29,"CEN - Cordoba - Este",29,"ARROYO CABRAL","-","-","-",132,{"$f":"IF(OR(DATOS_QR!$F$8=2,DATOS_QR!$F$8=\"\"),\"\",T26)","v":""},97,"CASTELLI CHACO",13.2,33,"-",132]
[null,"SGO.DEL ESTERO",null,null,null,null,"EMPRESA JUJEÑA DE ENERGIA SA",1345,"EJUESAYD",null,5104,"CEN - Cordoba - Este",5104,"J. POSSE","-",33,"-",132,{"$f":"IF(OR(DATOS_QR!$F$8=2,DATOS_QR!$F$8=\"\"),\"\",T27)","v":""},99,"CATAMARCA",13.2,33,"-",132]
[null,"TUCUMAN",null,null,null,null,"EMP DIST ENERG NORTE",1373,"EDENBA1D",null,244,"CEN - Cordoba - Este",244,"ISLA VERDE",13.2,33,66,132,{"$f":"IF(OR(DATOS_QR!$F$8=2,DATOS_QR!$F$8=\"\"),\"\",T28)","v":""},101,"CAUCETE",13.2,33,"-",132]
[null,null,null,null,null,null,"EMP DIST ENERG SUR",1374,"EDESBA2D",null,52,"CEN - Cordoba - Este",52,"BELL VILLE",13.2,"-","-",132,{"$f":"IF(OR(DATOS_QR!$F$8=2,DATOS_QR!$F$8=\"\"),\"\",T29)","v":""},109,"CHACABUCO",13.2,33,"-",132]
[null,null,null,null,null,null,"EMP DIST ENERG ATLANTICA",1375,"EDEABA3D",null,284,"CEN - Cordoba - Este",284,"LEONES","-","-",66,132,{"$f":"IF(OR(DATOS_QR!$F$8=2,DATOS_QR!$F$8=\"\"),\"\",T30)","v":""},111,"CHAMICAL",13.2,33,"-",132]
{"$rows_left_out":269}